BDBM429529 med.21724, Compound Benztropine
SMILES CN1[C@H]2CC[C@@H]1CC(C2)OC(c1ccccc1)c1ccccc1
InChI Key InChIKey=GIJXKZJWITVLHI-YOFSQIOKSA-N
Data  2 EC50
  Tab Delimited (TSV)   2D SDfile   Computed 3D by Vconf -m prep SDfile
Find this compound or compounds like it in BindingDB:
Activity Spreadsheet -- Enzyme Inhibition Constant Data from BindingDB
Found 2 hits for monomerid = 429529
TargetReplicase polyprotein 1ab(Human SARS coronavirus (SARS-CoV) (Severe acute re...)
University of Bonn
LigandPNGBDBM429529(med.21724, Compound Benztropine)
Affinity DataEC50:  2.16E+4nM. Assay description: This is a review article.
In DepthDetails ArticlePubMed
TargetOrf1a protein(MERS-CoV)
University of Bonn
LigandPNGBDBM429529(med.21724, Compound Benztropine)
Affinity DataEC50:  1.66E+4nM. Assay description: This is a review article.
In DepthDetails ArticlePubMed